Target
Beta-galactosidase
Ligand
BDBM47581
Substrate
Meas. Tech.
HTS Dose response counterscreen for assays utilizing the enzyme, beta-galactosidase - Set 3
IC50
>66600±0 nM
Citation
 PubChem, PC HTS Dose response counterscreen for assays utilizing the enzyme, beta-galactosidase - Set 3 PubChem Bioassay (2011)[AID] 
Target
Name:
Beta-galactosidase
Synonyms:
BGAL_ECOLX Lactase | lacZ
Type:
PROTEIN
Mol. Mass.:
116943.87
Organism:
Escherichia coli
Description:
ChEMBL_215882
Residue:
1029
  
Inhibitor
Name:
BDBM47581
Synonyms:
(3Z)-3-(1-methyl-5-oxidanylidene-2-sulfanylidene-imidazolidin-4-ylidene)-1H-indol-2-one (3Z)-3-(1-methyl-5-oxo-2-sulfanylideneimidazolidin-4-ylidene)-1H-indol-2-one 3-(1-methyl-5-oxo-2-thioxo-4-imidazolidinylidene)-1,3-dihydro-2H-indol-2-one SMR000198608 | cid_5738220
Type:
Small organic molecule
Emp. Form.:
C12H9N3O2S
Mol. Mass.:
259.284
SMILES:
CN1C(=S)N\C(C1=O)=C1/C(=O)Nc2ccccc12
: