Target
DNA dC->dU-editing enzyme APOBEC-3G
Ligand
BDBM80153
Substrate
Meas. Tech.
Dose Response confirmation of small molecule APOBEC3G DNA Deaminase Inhibitors via a fluorescence-based single-stranded DNA deaminase assay
Temperature
298.15±n/a K
IC50
1790±n/a nM
Comments
extracted
Citation
 PubChem, PC Dose Response confirmation of small molecule APOBEC3G DNA Deaminase Inhibitors via a fluorescence-based single-stranded DNA deaminase assay PubChem Bioassay (2011)[AID] 
Target
Name:
DNA dC->dU-editing enzyme APOBEC-3G
Synonyms:
ABC3G_HUMAN | APOBEC3G
Type:
Enzyme Catalytic Domain
Mol. Mass.:
46419.54
Organism:
Homo sapiens (Human)
Description:
gi_13399304
Residue:
384
  
Inhibitor
Name:
BDBM80153
Synonyms:
3-(2-furanyl)-4-[(3-methyl-2-thiophenyl)methylideneamino]-1H-1,2,4-triazole-5-thione 3-(furan-2-yl)-4-[(3-methylthiophen-2-yl)methylideneamino]-1H-1,2,4-triazole-5-thione MLS000577363 cid_668556
Type:
Small organic molecule
Emp. Form.:
C12H10N4OS2
Mol. Mass.:
290.364
SMILES:
Cc1ccsc1C=Nn1c(n[nH]c1=S)-c1ccco1
: