Target
DNA dC->dU-editing enzyme APOBEC-3G
Ligand
BDBM80259
Substrate
Meas. Tech.
Dose Response confirmation of small molecule APOBEC3G DNA Deaminase Inhibitors via a fluorescence-based single-stranded DNA deaminase assay
Temperature
298.15±n/a K
IC50
2470±n/a nM
Comments
extracted
Citation
 PubChem, PC Dose Response confirmation of small molecule APOBEC3G DNA Deaminase Inhibitors via a fluorescence-based single-stranded DNA deaminase assay PubChem Bioassay (2011)[AID] 
Target
Name:
DNA dC->dU-editing enzyme APOBEC-3G
Synonyms:
ABC3G_HUMAN | APOBEC3G
Type:
Enzyme Catalytic Domain
Mol. Mass.:
46419.54
Organism:
Homo sapiens (Human)
Description:
gi_13399304
Residue:
384
  
Inhibitor
Name:
BDBM80259
Synonyms:
4-[(E)-3-Furan-2-yl-2-methyl-prop-2-en-(E)-ylideneamino]-5-(5-methyl-2H-pyrazol-3-yl)-4H-[1,2,4]triazol e-3-thiol 4-[[(E)-3-(2-furyl)-2-methyl-prop-2-enylidene]amino]-3-(5-methyl-1H-pyrazol-3-yl)-1H-1,2,4-triazole-5-thione 4-[[(E)-3-(furan-2-yl)-2-methylprop-2-enylidene]amino]-3-(5-methyl-1H-pyrazol-3-yl)-1H-1,2,4-triazole-5-thione SMR000438141 | cid_1400054
Type:
Small organic molecule
Emp. Form.:
C14H14N6OS
Mol. Mass.:
314.366
SMILES:
CC(C=Nn1c(n[nH]c1=S)-c1cc(C)[nH]n1)=Cc1ccco1
: