Target
DNA dC->dU-editing enzyme APOBEC-3G
Ligand
BDBM61876
Substrate
Meas. Tech.
Dose Response confirmation of small molecule APOBEC3G DNA Deaminase Inhibitors via a fluorescence-based single-stranded DNA deaminase assay
Temperature
298.15±n/a K
IC50
2240±n/a nM
Comments
extracted
Citation
 PubChem, PC Dose Response confirmation of small molecule APOBEC3G DNA Deaminase Inhibitors via a fluorescence-based single-stranded DNA deaminase assay PubChem Bioassay (2011)[AID] 
Target
Name:
DNA dC->dU-editing enzyme APOBEC-3G
Synonyms:
ABC3G_HUMAN | APOBEC3G
Type:
Enzyme Catalytic Domain
Mol. Mass.:
46419.54
Organism:
Homo sapiens (Human)
Description:
gi_13399304
Residue:
384
  
Inhibitor
Name:
BDBM61876
Synonyms:
3-[(2-nitrophenyl)sulfanylmethyl]-4-prop-2-enyl-1H-1,2,4-triazole-5-thione 4-allyl-3-[[(2-nitrophenyl)thio]methyl]-1H-1,2,4-triazole-5-thione SMR000567368 | cid_2807230
Type:
Small organic molecule
Emp. Form.:
C12H12N4O2S2
Mol. Mass.:
308.379
SMILES:
[O-][N+](=O)c1ccccc1SCc1n[nH]c(=S)n1CC=C
: