Target
DNA dC->dU-editing enzyme APOBEC-3A
Ligand
BDBM80155
Substrate
Meas. Tech.
Dose Response confirmation of APOBEC3G DNA Deaminase Inhibitors via a A3A counterscreen
Temperature
298.15±n/a K
IC50
>100000±n/a nM
Comments
extracted
Citation
 PubChem, PC Dose Response confirmation of APOBEC3G DNA Deaminase Inhibitors via a A3A counterscreen PubChem Bioassay (2011)[AID] 
Target
Name:
DNA dC->dU-editing enzyme APOBEC-3A
Synonyms:
ABC3A_HUMAN probable DNA dC->dU-editing enzyme APOBEC-3A
Type:
Enzyme Catalytic Domain
Mol. Mass.:
23013.77
Organism:
Homo sapiens (Human)
Description:
gi_21955158
Residue:
199
  
Inhibitor
Name:
BDBM80155
Synonyms:
4-butyl-3-(4-nitrophenyl)-1H-1,2,4-triazole-5-thione MLS000581174 cid_2205509
Type:
Small organic molecule
Emp. Form.:
C12H14N4O2S
Mol. Mass.:
278.33
SMILES:
CCCCn1c(n[nH]c1=S)-c1ccc(cc1)[N+]([O-])=O
: