Target
Egl nine homolog 1
Ligand
BDBM141581
Substrate
Meas. Tech.
HIF-PH Assay
pH
7.4±n/a
IC50
390±n/a nM
Comments
extracted
Citation
 Ng, DArend, MPFlippin, LA Naphthyridine derivatives as inhibitors of Hypoxia inducible factor (HIF) hydroxylase US Patent  US9695170 Publication Date 7/4/2017 
Target
Name:
Egl nine homolog 1
Synonyms:
C1orf12 EGLN1_HUMAN Hypoxia-inducible factor prolyl hydroxylase 2 (HIF-PH2) Prolyl hydroxylase domain-containing protein 2 (PHD2)
Type:
Protein
Mol. Mass.:
46035.59
Organism:
Homo sapiens (Human)
Description:
Q9GZT9
Residue:
426
  
Inhibitor
Name:
BDBM141581
Synonyms:
US8921389, 37 | US9695170 37
Type:
Small organic molecule
Emp. Form.:
C19H17N3O3
Mol. Mass.:
335.3566
SMILES:
Oc1c(ncc2c1ccn(Cc1ccccc1)c2=O)C(=O)NC1CC1
: