Target
DNA dC->dU-editing enzyme APOBEC-3A
Ligand
BDBM61266
Substrate
Meas. Tech.
Dose Response confirmation of small molecule APOBEC3A DNA Deaminase Inhibitors via a fluorescence-based single-stranded DNA deaminase assay
Temperature
298.15±n/a K
IC50
1300±n/a nM
Comments
extracted
Citation
 PubChem, PC Dose Response confirmation of small molecule APOBEC3A DNA Deaminase Inhibitors via a fluorescence-based single-stranded DNA deaminase assay PubChem Bioassay (2011)[AID] 
Target
Name:
DNA dC->dU-editing enzyme APOBEC-3A
Synonyms:
ABC3A_HUMAN probable DNA dC->dU-editing enzyme APOBEC-3A
Type:
Enzyme Catalytic Domain
Mol. Mass.:
23013.77
Organism:
Homo sapiens (Human)
Description:
gi_21955158
Residue:
199
  
Inhibitor
Name:
BDBM61266
Synonyms:
(1-amyl-4-pyridylidene)amine;hydroiodide 1-pentylpyridin-4-imine;hydroiodide SMR000038259 | cid_6603239
Type:
Small organic molecule
Emp. Form.:
C10H16N2
Mol. Mass.:
164.2474
SMILES:
CCCCCn1ccc(=N)cc1
: