Target
DNA dC->dU-editing enzyme APOBEC-3A
Ligand
BDBM61339
Substrate
Meas. Tech.
Dose Response confirmation of small molecule APOBEC3A DNA Deaminase Inhibitors via a fluorescence-based single-stranded DNA deaminase assay
Temperature
298.15±n/a K
IC50
1080±n/a nM
Comments
extracted
Citation
 PubChem, PC Dose Response confirmation of small molecule APOBEC3A DNA Deaminase Inhibitors via a fluorescence-based single-stranded DNA deaminase assay PubChem Bioassay (2011)[AID] 
Target
Name:
DNA dC->dU-editing enzyme APOBEC-3A
Synonyms:
ABC3A_HUMAN probable DNA dC->dU-editing enzyme APOBEC-3A
Type:
Enzyme Catalytic Domain
Mol. Mass.:
23013.77
Organism:
Homo sapiens (Human)
Description:
gi_21955158
Residue:
199
  
Inhibitor
Name:
BDBM61339
Synonyms:
2-[(2Z)-2-[(1-methyl-2-pyridin-1-iumyl)methylidene]-1,3-benzothiazol-3-yl]ethanol;iodide 2-[(2Z)-2-[(1-methylpyridin-1-ium-2-yl)methylidene]-1,3-benzothiazol-3-yl]ethanol;iodide MLS001212885 cid_24747025
Type:
Small organic molecule
Emp. Form.:
C16H17N2OS
Mol. Mass.:
285.383
SMILES:
C[n+]1ccccc1\C=C1/Sc2ccccc2N1CCO
: