Target
C-C chemokine receptor type 6
Ligand
BDBM43363
Substrate
Meas. Tech.
Dose Response confirmation of small molecule antagonists of the CCR6 receptor: a luminescent beta-arrestin assay
IC50
>66600±n/a nM
Citation
 PubChem, PC Dose Response confirmation of small molecule antagonists of the CCR6 receptor: a luminescent beta-arrestin assay PubChem Bioassay (2011)[AID] 
Target
Name:
C-C chemokine receptor type 6
Synonyms:
C-C chemokine receptor type 6 CCR6 CKRL3 GPR29 | STRL22
Type:
Enzyme
Mol. Mass.:
42510.84
Organism:
Homo sapiens (Human)
Description:
P51684
Residue:
374
  
Inhibitor
Name:
BDBM43363
Synonyms:
2,5-bis(chloranyl)-3-piperidin-1-yl-6-(2-piperidin-1-yl-1,3-thiazol-5-yl)cyclohexa-2,5-diene-1,4-dione 2,5-dichloro-3-(1-piperidinyl)-6-[2-(1-piperidinyl)-5-thiazolyl]cyclohexa-2,5-diene-1,4-dione 2,5-dichloro-3-piperidino-6-(2-piperidinothiazol-5-yl)-p-benzoquinone SMR000115104 | cid_406171
Type:
Small organic molecule
Emp. Form.:
C19H21Cl2N3O2S
Mol. Mass.:
426.36
SMILES:
ClC1=C(N2CCCCC2)C(=O)C(Cl)=C(c2cnc(s2)N2CCCCC2)C1=O
: