Target
C-C chemokine receptor type 6
Ligand
BDBM79980
Substrate
Meas. Tech.
Dose Response confirmation of small molecule antagonists of the CCR6 receptor: a luminescent beta-arrestin assay
IC50
17800±n/a nM
Citation
 PubChem, PC Dose Response confirmation of small molecule antagonists of the CCR6 receptor: a luminescent beta-arrestin assay PubChem Bioassay (2011)[AID] 
Target
Name:
C-C chemokine receptor type 6
Synonyms:
C-C chemokine receptor type 6 CCR6 CKRL3 GPR29 | STRL22
Type:
Enzyme
Mol. Mass.:
42510.84
Organism:
Homo sapiens (Human)
Description:
P51684
Residue:
374
  
Inhibitor
Name:
BDBM79980
Synonyms:
2-(4-methylsulfonyl-2,6-dinitro-phenyl)sulfanyl-1H-benzimidazole 2-[(4-mesyl-2,6-dinitro-phenyl)thio]-1H-benzimidazole MLS000565579 cid_4460245
Type:
Small organic molecule
Emp. Form.:
C14H10N4O6S2
Mol. Mass.:
394.382
SMILES:
CS(=O)(=O)c1cc(c(Sc2nc3ccccc3[nH]2)c(c1)[N+]([O-])=O)[N+]([O-])=O
: