Target
C-C chemokine receptor type 6
Ligand
BDBM42233
Substrate
Meas. Tech.
Dose Response confirmation of small molecule antagonists of the CCR6 receptor: a luminescent beta-arrestin assay
IC50
15300±n/a nM
Citation
 PubChem, PC Dose Response confirmation of small molecule antagonists of the CCR6 receptor: a luminescent beta-arrestin assay PubChem Bioassay (2011)[AID] 
Target
Name:
C-C chemokine receptor type 6
Synonyms:
C-C chemokine receptor type 6 CCR6 CKRL3 GPR29 | STRL22
Type:
Enzyme
Mol. Mass.:
42510.84
Organism:
Homo sapiens (Human)
Description:
P51684
Residue:
374
  
Inhibitor
Name:
BDBM42233
Synonyms:
4-ethyl-N-[(1Z)-4-oxo-3-(1H-1,2,4-triazol-3-ylthio)naphthalen-1(4H)-ylidene]benzenesulfonamide 4-ethyl-N-[4-oxidanylidene-3-(1H-1,2,4-triazol-5-ylsulfanyl)naphthalen-1-ylidene]benzenesulfonamide 4-ethyl-N-[4-oxo-3-(1H-1,2,4-triazol-5-ylthio)-1-naphthalenylidene]benzenesulfonamide SMR000207686 | cid_3318216
Type:
Small organic molecule
Emp. Form.:
C20H16N4O3S2
Mol. Mass.:
424.496
SMILES:
CCc1ccc(cc1)S(=O)(=O)N=C1C=C(Sc2nnc[nH]2)C(=O)c2ccccc12
: