Target
C-C chemokine receptor type 6
Ligand
BDBM70948
Substrate
Meas. Tech.
Dose Response confirmation of small molecule antagonists of the CCR6 receptor: a luminescent beta-arrestin assay
IC50
14100±n/a nM
Citation
 PubChem, PC Dose Response confirmation of small molecule antagonists of the CCR6 receptor: a luminescent beta-arrestin assay PubChem Bioassay (2011)[AID] 
Target
Name:
C-C chemokine receptor type 6
Synonyms:
C-C chemokine receptor type 6 CCR6 CKRL3 GPR29 | STRL22
Type:
Enzyme
Mol. Mass.:
42510.84
Organism:
Homo sapiens (Human)
Description:
P51684
Residue:
374
  
Inhibitor
Name:
BDBM70948
Synonyms:
1-(3-bromobenzoyl)-5-(4-chlorophenyl)-5-hydroxy-2-pyrazoline-3-carboxylic acid methyl ester MLS000684823 cid_2884240 methyl 1-(3-bromobenzoyl)-5-(4-chlorophenyl)-5-hydroxy-4H-pyrazole-3-carboxylate | methyl 1-(3-bromophenyl)carbonyl-5-(4-chlorophenyl)-5-oxidanyl-4H-pyrazole-3-carboxylate
Type:
Small organic molecule
Emp. Form.:
C18H14BrClN2O4
Mol. Mass.:
437.672
SMILES:
COC(=O)C1=NN(C(=O)c2cccc(Br)c2)C(O)(C1)c1ccc(Cl)cc1
: