Target
Hexokinase HKDC1 [W721R]
Ligand
BDBM53262
Substrate
Meas. Tech.
Dose Response confirmation of inhibitors of hexokinase domain containing I (HKDC1)
IC50
4670±n/a nM
Citation
 PubChem, PC Dose Response confirmation of inhibitors of hexokinase domain containing I (HKDC1) PubChem Bioassay (2011)[AID] 
Target
Name:
Hexokinase HKDC1 [W721R]
Synonyms:
HKDC1 putative hexokinase HKDC1
Type:
Enzyme Catalytic Domain
Mol. Mass.:
102520.24
Organism:
Homo sapiens (Human)
Description:
gi_156151420
Residue:
917
  
Inhibitor
Name:
BDBM53262
Synonyms:
2-[4-[(4-chlorophenyl)sulfonylamino]-1-hydroxynaphthalen-2-yl]sulfanylacetic acid 2-[[4-[(4-chlorophenyl)sulfonylamino]-1-hydroxy-2-naphthalenyl]thio]acetic acid MLS001196186 [(4-{[(4-chlorophenyl)sulfonyl]amino}-1-hydroxy-2-naphthyl)thio]acetic acid | cid_1309516
Type:
Small organic molecule
Emp. Form.:
C18H14ClNO5S2
Mol. Mass.:
423.89
SMILES:
OC(=O)CSc1cc(NS(=O)(=O)c2ccc(Cl)cc2)c2ccccc2c1O
: