Target
Hexokinase HKDC1 [W721R]
Ligand
BDBM80762
Substrate
Meas. Tech.
Dose Response confirmation of inhibitors of hexokinase domain containing I (HKDC1)
IC50
2690±n/a nM
Citation
 PubChem, PC Dose Response confirmation of inhibitors of hexokinase domain containing I (HKDC1) PubChem Bioassay (2011)[AID] 
Target
Name:
Hexokinase HKDC1 [W721R]
Synonyms:
HKDC1 putative hexokinase HKDC1
Type:
Enzyme Catalytic Domain
Mol. Mass.:
102520.24
Organism:
Homo sapiens (Human)
Description:
gi_156151420
Residue:
917
  
Inhibitor
Name:
BDBM80762
Synonyms:
Bacitracin Bacitracin zinc salt SMR001306784 | cid_16219032
Type:
Small organic molecule
Emp. Form.:
C66H101N17O16SZn
Mol. Mass.:
1486.086
SMILES:
[Zn++].[H][C@]1(NC(=O)[C@@H](CCCN)NC(=O)[C@H](CCCCNC(=O)[C@H](CC(N)=O)NC(=O)[C@@H](CC([O-])=O)NC(=O)[C@H](Cc2cnc[nH]2)NC(=O)[C@@H](Cc2ccccc2)NC1=O)NC(=O)[C@@H](NC(=O)[C@@H](CCC([O-])=O)NC(=O)[C@H](CC(C)C)NC(=O)C1CSC(=N1)C(N)C(C)CC)[C@@H](C)CC)[C@@H](C)CC
: