Target
Hexokinase HKDC1 [W721R]
Ligand
BDBM46685
Substrate
Meas. Tech.
Dose Response confirmation of activators of hexokinase domain containing I (HKDC1)
EC50
59000±n/a nM
Citation
 PubChem, PC Dose Response confirmation of activators of hexokinase domain containing I (HKDC1) PubChem Bioassay (2011)[AID] 
Target
Name:
Hexokinase HKDC1 [W721R]
Synonyms:
HKDC1 putative hexokinase HKDC1
Type:
Enzyme Catalytic Domain
Mol. Mass.:
102520.24
Organism:
Homo sapiens (Human)
Description:
gi_156151420
Residue:
917
  
Inhibitor
Name:
BDBM46685
Synonyms:
(4-chlorodithiazol-5-ylidene)-(p-tolyl)amine 4-chloro-N-(4-methylphenyl)-5-dithiazolimine MLS-0390832.0001 | cid_715719
Type:
Small organic molecule
Emp. Form.:
C9H7ClN2S2
Mol. Mass.:
242.748
SMILES:
Cc1ccc(cc1)\N=c1\ssnc1Cl
: