Target
Hexokinase HKDC1 [W721R]
Ligand
BDBM80777
Substrate
Meas. Tech.
Dose Response confirmation of activators of hexokinase domain containing I (HKDC1)
EC50
>80000±n/a nM
Citation
 PubChem, PC Dose Response confirmation of activators of hexokinase domain containing I (HKDC1) PubChem Bioassay (2011)[AID] 
Target
Name:
Hexokinase HKDC1 [W721R]
Synonyms:
HKDC1 putative hexokinase HKDC1
Type:
Enzyme Catalytic Domain
Mol. Mass.:
102520.24
Organism:
Homo sapiens (Human)
Description:
gi_156151420
Residue:
917
  
Inhibitor
Name:
BDBM80777
Synonyms:
(6E)-6-[[(4-amino-1,2,4-triazol-3-yl)hydrazo]methylidene]-2,4-dibromo-1-cyclohexa-2,4-dienone;hydrochloride (6E)-6-[[2-(4-azanyl-1,2,4-triazol-3-yl)hydrazinyl]methylidene]-2,4-bis(bromanyl)cyclohexa-2,4-dien-1-one;hydrochloride 3,5-dibromo-2-hydroxybenzaldehyde (4-amino-4H-1,2,4-triazol-3-yl)hydrazone SMR000161885 | cid_11958783
Type:
Small organic molecule
Emp. Form.:
C9H8Br2N6O
Mol. Mass.:
376.007
SMILES:
Nn1cnnc1N=NCc1cc(Br)cc(Br)c1O
: