Target
Hexokinase HKDC1 [W721R]
Ligand
BDBM64731
Substrate
Meas. Tech.
Dose Response confirmation of activators of hexokinase domain containing I (HKDC1)
EC50
13300±n/a nM
Citation
 PubChem, PC Dose Response confirmation of activators of hexokinase domain containing I (HKDC1) PubChem Bioassay (2011)[AID] 
Target
Name:
Hexokinase HKDC1 [W721R]
Synonyms:
HKDC1 putative hexokinase HKDC1
Type:
Enzyme Catalytic Domain
Mol. Mass.:
102520.24
Organism:
Homo sapiens (Human)
Description:
gi_156151420
Residue:
917
  
Inhibitor
Name:
BDBM64731
Synonyms:
MLS001212827 N-[[4-(diethylamino)phenyl]-(8-hydroxy-7-quinolyl)methyl]valeramide N-[[4-(diethylamino)phenyl]-(8-oxidanylquinolin-7-yl)methyl]pentanamide SMR000517138 | cid_2920952
Type:
Small organic molecule
Emp. Form.:
C25H31N3O2
Mol. Mass.:
405.5325
SMILES:
CCCCC(=O)NC(c1ccc(cc1)N(CC)CC)c1ccc2cccnc2c1O
: