Target
Hexokinase HKDC1 [W721R]
Ligand
BDBM71373
Substrate
Meas. Tech.
Dose Response confirmation of activators of hexokinase domain containing I (HKDC1)
EC50
9250±n/a nM
Citation
 PubChem, PC Dose Response confirmation of activators of hexokinase domain containing I (HKDC1) PubChem Bioassay (2011)[AID] 
Target
Name:
Hexokinase HKDC1 [W721R]
Synonyms:
HKDC1 putative hexokinase HKDC1
Type:
Enzyme Catalytic Domain
Mol. Mass.:
102520.24
Organism:
Homo sapiens (Human)
Description:
gi_156151420
Residue:
917
  
Inhibitor
Name:
BDBM71373
Synonyms:
2-chloranyl-3-(pyridin-3-ylmethylamino)naphthalene-1,4-dione 2-chloro-3-(3-pyridylmethylamino)-1,4-naphthoquinone 2-chloro-3-[(3-pyridinylmethyl)amino]naphthoquinone SMR000550701 | cid_3780874
Type:
Small organic molecule
Emp. Form.:
C16H11ClN2O2
Mol. Mass.:
298.724
SMILES:
Oc1c(Cl)c(N=Cc2cccnc2)c(O)c2ccccc12
: