Target
Cysteine protease ATG4B
Ligand
BDBM39704
Substrate
Meas. Tech.
Dose response confirmation of the uHTS fluorescent assay for identification of inhibitors of ATG4B.
IC50
5440±n/a nM
Citation
 PubChem, PC Dose response confirmation of the uHTS fluorescent assay for identification of inhibitors of ATG4B. PubChem Bioassay (2011)[AID] 
Target
Name:
Cysteine protease ATG4B
Synonyms:
APG4B ATG4B_HUMAN KIAA0943 hck
Type:
Enzyme Catalytic Domain
Mol. Mass.:
44279.79
Organism:
Homo sapiens (Human)
Description:
gi_47132611
Residue:
393
  
Inhibitor
Name:
BDBM39704
Synonyms:
(3-methyl-4-propan-2-yl-phenyl) thiophene-2-carboxylate 2-thiophenecarboxylic acid (3-methyl-4-propan-2-ylphenyl) ester MLS000533631 cid_881438 | thiophene-2-carboxylic acid (4-isopropyl-3-methyl-phenyl) ester
Type:
Small organic molecule
Emp. Form.:
C15H16O2S
Mol. Mass.:
260.351
SMILES:
CC(C)c1ccc(OC(=O)c2cccs2)cc1C
: