Target
Cysteine protease ATG4B
Ligand
BDBM68008
Substrate
Meas. Tech.
Dose response confirmation of the uHTS fluorescent assay for identification of inhibitors of ATG4B.
IC50
2510±n/a nM
Citation
 PubChem, PC Dose response confirmation of the uHTS fluorescent assay for identification of inhibitors of ATG4B. PubChem Bioassay (2011)[AID] 
Target
Name:
Cysteine protease ATG4B
Synonyms:
APG4B ATG4B_HUMAN KIAA0943 hck
Type:
Enzyme Catalytic Domain
Mol. Mass.:
44279.79
Organism:
Homo sapiens (Human)
Description:
gi_47132611
Residue:
393
  
Inhibitor
Name:
BDBM68008
Synonyms:
3-[(4-bromobenzoyl)oxy]-2-(3,5-dimethoxyphenyl)quinazolin-4(3H)-one 4-bromobenzoic acid [2-(3,5-dimethoxyphenyl)-4-oxo-3-quinazolinyl] ester SMR000203713 [2-(3,5-dimethoxyphenyl)-4-oxoquinazolin-3-yl] 4-bromobenzoate | cid_12004873
Type:
Small organic molecule
Emp. Form.:
C23H17BrN2O5
Mol. Mass.:
481.295
SMILES:
COc1cc(OC)cc(c1)-c1nc2ccccc2c(=O)n1OC(=O)c1ccc(Br)cc1
: