Target
Cysteine protease ATG4B
Ligand
BDBM29684
Substrate
Meas. Tech.
Dose response confirmation of the uHTS fluorescent assay for identification of inhibitors of ATG4B.
IC50
14400±n/a nM
Citation
 PubChem, PC Dose response confirmation of the uHTS fluorescent assay for identification of inhibitors of ATG4B. PubChem Bioassay (2011)[AID] 
Target
Name:
Cysteine protease ATG4B
Synonyms:
APG4B ATG4B_HUMAN KIAA0943 hck
Type:
Enzyme Catalytic Domain
Mol. Mass.:
44279.79
Organism:
Homo sapiens (Human)
Description:
gi_47132611
Residue:
393
  
Inhibitor
Name:
BDBM29684
Synonyms:
(3E)-3-(2-furanylmethylidene)-1,2-dihydrocyclopenta[b]quinoline-9-carboxylic acid [2-[(2-methylcyclohexyl)amino]-2-oxoethyl] ester MLS000336228 [2-[(2-methylcyclohexyl)amino]-2-oxidanylidene-ethyl] (3E)-3-(furan-2-ylmethylidene)-1,2-dihydrocyclopenta[b]quinoline-9-carboxylate cid_5860596
Type:
Small organic molecule
Emp. Form.:
C27H28N2O4
Mol. Mass.:
444.5222
SMILES:
CC1CCCCC1NC(=O)COC(=O)c1c2CC\C(=C/c3ccco3)c2nc2ccccc12
: