Target
Hexokinase-1
Ligand
BDBM80775
Substrate
Meas. Tech.
Dose Response confirmation of activators of hexokinase domain containing I (HKDC1) in the hexokinase 1 selectivity assay
EC50
47400±n/a nM
Citation
 PubChem, PC Dose Response confirmation of activators of hexokinase domain containing I (HKDC1) in the hexokinase 1 selectivity assay PubChem Bioassay (2011)[AID] 
Target
Name:
Hexokinase-1
Synonyms:
Brain form hexokinase HK1 Hexokinase type I hexokinase-1 isoform HKI
Type:
PROTEIN
Mol. Mass.:
102488.34
Organism:
Homo sapiens (Human)
Description:
EBI_11382
Residue:
917
  
Inhibitor
Name:
BDBM80775
Synonyms:
1-[4-(4-tert-butylphenyl)-1,3-thiazol-2-yl]-2-(3,4,5,6-tetrahydro-2H-azepin-7-yl)diazane;hydrobromide 1-[4-(4-tert-butylphenyl)-2-thiazolyl]-2-(3,4,5,6-tetrahydro-2H-azepin-7-yl)hydrazine;hydrobromide MLS000564997 cid_11834397
Type:
Small organic molecule
Emp. Form.:
C19H26N4S
Mol. Mass.:
342.502
SMILES:
CC(C)(C)c1ccc(cc1)-c1csc(NNC2=NCCCCC2)n1
: