Target
Hexokinase-1
Ligand
BDBM63662
Substrate
Meas. Tech.
Dose Response confirmation of activators of hexokinase domain containing I (HKDC1) in the hexokinase 1 selectivity assay
EC50
19300±n/a nM
Citation
 PubChem, PC Dose Response confirmation of activators of hexokinase domain containing I (HKDC1) in the hexokinase 1 selectivity assay PubChem Bioassay (2011)[AID] 
Target
Name:
Hexokinase-1
Synonyms:
Brain form hexokinase HK1 Hexokinase type I hexokinase-1 isoform HKI
Type:
PROTEIN
Mol. Mass.:
102488.34
Organism:
Homo sapiens (Human)
Description:
EBI_11382
Residue:
917
  
Inhibitor
Name:
BDBM63662
Synonyms:
1,3-dihydroindole-2-thione SMR000343599 indoline-2-thione
Type:
Small organic molecule
Emp. Form.:
C8H7NS
Mol. Mass.:
149.213
SMILES:
S=C1Cc2ccccc2N1
: