Target
Glucose-6-phosphate dehydrogenase-6-phosphogluconolactonase
Ligand
BDBM40697
Substrate
Meas. Tech.
Dose Response confirmation of uHTS small molecule inhibitors of Plasmodium falciparum Glucose-6-phosphate dehydrogenase via a fluorescence intensity assay
IC50
11500±n/a nM
Citation
 PubChem, PC Dose Response confirmation of uHTS small molecule inhibitors of Plasmodium falciparum Glucose-6-phosphate dehydrogenase via a fluorescence intensity assay PubChem Bioassay (2011)[AID] 
Target
Name:
Glucose-6-phosphate dehydrogenase-6-phosphogluconolactonase
Synonyms:
Type:
Enzyme Catalytic Domain
Mol. Mass.:
109731.64
Organism:
Plasmodium falciparum 3D7
Description:
gi_12381848
Residue:
950
  
Inhibitor
Name:
BDBM40697
Synonyms:
4-(2,3-dihydroimidazo[2,1-b][1,3]thiazol-6-yl)-1,2-benzenediol 4-(2,3-dihydroimidazo[2,1-b]thiazol-6-yl)benzene-1,2-diol MLS000530540 cid_877570
Type:
Small organic molecule
Emp. Form.:
C11H10N2O2S
Mol. Mass.:
234.274
SMILES:
Oc1ccc(cc1O)-c1cn2CCSc2n1
: