Target
Glucose-6-phosphate 1-dehydrogenase
Ligand
BDBM47803
Substrate
Meas. Tech.
Human Glucose-6-Phosphate Dehydrogenase Dose Response Selectivity Assay for Inhibitors of Plasmodium falciparum Glucose-6-Phosphate Dehydrogenase
IC50
20700±n/a nM
Citation
 PubChem, PC Human Glucose-6-Phosphate Dehydrogenase Dose Response Selectivity Assay for Inhibitors of Plasmodium falciparum Glucose-6-Phosphate Dehydrogenase PubChem Bioassay (2011)[AID] 
Target
Name:
Glucose-6-phosphate 1-dehydrogenase
Synonyms:
G6PD Glucose 6-phosphate dehydrogenase (G6PD) glucose-6-phosphate 1-dehydrogenase isoform b
Type:
Enzyme
Mol. Mass.:
59258.58
Organism:
Homo sapiens (Human)
Description:
P11413
Residue:
515
  
Inhibitor
Name:
BDBM47803
Synonyms:
MLS000689393 N-(4-chlorophenyl)-2-(4,6-dimethyl-3-oxidanylidene-[1,2]thiazolo[5,4-b]pyridin-2-yl)ethanamide N-(4-chlorophenyl)-2-(4,6-dimethyl-3-oxo-[1,2]thiazolo[5,4-b]pyridin-2-yl)acetamide SMR000311192 | cid_4247469
Type:
Small organic molecule
Emp. Form.:
C16H14ClN3O2S
Mol. Mass.:
347.819
SMILES:
Cc1cc(C)c2c(n1)sn(CC(=O)Nc1ccc(Cl)cc1)c2=O
: