Target
cAMP-dependent protein kinase type I-alpha regulatory subunit
Ligand
BDBM81289
Substrate
Meas. Tech.
Fluorescence polarization-based biochemical high throughput dose response assay for activators of the Protein Kinase A-R1A (PKA-R1A) complex
EC50
67.98±n/a nM
Citation
 PubChem, PC Fluorescence polarization-based biochemical high throughput dose response assay for activators of the Protein Kinase A-R1A (PKA-R1A) complex PubChem Bioassay (2011)[AID] 
Target
Name:
cAMP-dependent protein kinase type I-alpha regulatory subunit
Synonyms:
KAP0_BOVIN cAMP-dependent protein kinase
Type:
Enzyme Catalytic Domain
Mol. Mass.:
42885.14
Organism:
Bos taurus
Description:
gi_115496662
Residue:
380
  
Inhibitor
Name:
BDBM81289
Synonyms:
Adenosine 3',5'-cyclic monophosphate sodium salt monohydrate SMR000875274 sodium;(4aR,6R,7R,7aS)-6-(6-aminopurin-9-yl)-2-oxidanidyl-2-oxidanylidene-4a,6,7,7a-tetrahydro-4H-furo[3,2-d][1,3,2]dioxaphosphinin-7-ol sodium;(4aR,6R,7R,7aS)-6-(6-aminopurin-9-yl)-2-oxido-2-oxo-4a,6,7,7a-tetrahydro-4H-furo[3,2-d][1,3,2]dioxaphosphorin-7-ol | sodium;(4aR,6R,7R,7aS)-6-adenin-9-yl-2-keto-2-oxido-4a,6,7,7a-tetrahydro-4H-furo[3,2-d][1,3,2]dioxaphosphorin-7-ol
Type:
Small organic molecule
Emp. Form.:
C10H11N5O6P
Mol. Mass.:
328.1986
SMILES:
Nc1ncnc2n(cnc12)[C@@H]1O[C@@H]2COP([O-])(=O)O[C@H]2[C@H]1O
: