Target
cAMP-dependent protein kinase type II-beta regulatory subunit
Ligand
BDBM81289
Substrate
Meas. Tech.
Counterscreen for activators of the Protein Kinase A-R1A (PKA-R1A) complex
EC50
88.46±n/a nM
Citation
 PubChem, PC Counterscreen for activators of the Protein Kinase A-R1A (PKA-R1A) complex: fluorescence polarization-based biochemical high throughput dose response assay to identify activators of the Protein Kinase A-R2B (PKA-R2B) complex PubChem Bioassay (2011)[AID] 
Target
Name:
cAMP-dependent protein kinase type II-beta regulatory subunit
Synonyms:
KAP3_HUMAN | PRKAR2B
Type:
PROTEIN
Mol. Mass.:
46282.41
Organism:
Homo sapiens (Human)
Description:
EBI_11972
Residue:
418
  
Inhibitor
Name:
BDBM81289
Synonyms:
Adenosine 3',5'-cyclic monophosphate sodium salt monohydrate SMR000875274 sodium;(4aR,6R,7R,7aS)-6-(6-aminopurin-9-yl)-2-oxidanidyl-2-oxidanylidene-4a,6,7,7a-tetrahydro-4H-furo[3,2-d][1,3,2]dioxaphosphinin-7-ol sodium;(4aR,6R,7R,7aS)-6-(6-aminopurin-9-yl)-2-oxido-2-oxo-4a,6,7,7a-tetrahydro-4H-furo[3,2-d][1,3,2]dioxaphosphorin-7-ol | sodium;(4aR,6R,7R,7aS)-6-adenin-9-yl-2-keto-2-oxido-4a,6,7,7a-tetrahydro-4H-furo[3,2-d][1,3,2]dioxaphosphorin-7-ol
Type:
Small organic molecule
Emp. Form.:
C10H11N5O6P
Mol. Mass.:
328.1986
SMILES:
Nc1ncnc2n(cnc12)[C@@H]1O[C@@H]2COP([O-])(=O)O[C@H]2[C@H]1O
: