Target
Sterol 14-alpha demethylase
Ligand
BDBM81306
Substrate
Meas. Tech.
Inhibition Assay
pH
6±0
Kd
1.1e+2±n/a nM
Citation
 Lepesheva, GIOtt, RDHargrove, TYKleshchenko, YYSchuster, INes, WDHill, GCVillalta, FWaterman, MR Sterol 14alpha-demethylase as a potential target for antitrypanosomal therapy: enzyme inhibition and parasite cell growth. Chem Biol 14:1283-93 (2007)  
Target
Name:
Sterol 14-alpha demethylase
Synonyms:
CP51_TRYCC Cytochrome P450 51 Sterol 14α-demethylase (CYP51) Sterol 14-alpha demethylase (CYP51) | Tc14DM
Type:
Protein
Mol. Mass.:
54690.12
Organism:
Trypanosoma cruzi
Description:
Q7Z1V1
Residue:
481
  
Inhibitor
Name:
BDBM81306
Synonyms:
Azole, 11
Type:
Small organic molecule
Emp. Form.:
C26H24ClN3O2
Mol. Mass.:
445.941
SMILES:
COc1ccc(CC(CNC(=O)c2ccc(cc2)-c2ccc(Cl)cc2)n2ccnc2)cc1
: