Target
Lanosterol 14-alpha-demethylase
Ligand
BDBM25817
Substrate
Meas. Tech.
Inhibition Assay
pH
6±0
Kd
3.4e+2±n/a nM
Citation
 Lepesheva, GIOtt, RDHargrove, TYKleshchenko, YYSchuster, INes, WDHill, GCVillalta, FWaterman, MR Sterol 14alpha-demethylase as a potential target for antitrypanosomal therapy: enzyme inhibition and parasite cell growth. Chem Biol 14:1283-93 (2007)  
Target
Name:
Lanosterol 14-alpha-demethylase
Synonyms:
Lanosterol 14-alpha demethylase | Sterol 14-alpha demethylase (CYP51)
Type:
Protein
Mol. Mass.:
54377.77
Organism:
Trypanosoma brucei
Description:
Q385E8
Residue:
481
  
Inhibitor
Name:
BDBM25817
Synonyms:
2-(2,4-difluorophenyl)-1,3-bis(1H-1,2,4-triazol-1-yl)propan-2-ol Diflucan Fluconazole (f) Triflucan US11247981, Example Fluconazole US9144538, Fluconazole US9556143, Fluconazole | cid_3365
Type:
Small organic molecule
Emp. Form.:
C13H12F2N6O
Mol. Mass.:
306.2708
SMILES:
OC(Cn1cncn1)(Cn1cncn1)c1ccc(F)cc1F
: