Target
Sterol 14-alpha demethylase
Ligand
BDBM81307
Substrate
Meas. Tech.
Inhibition Assay
pH
6±0
Kd
6e+1±n/a nM
Citation
 Lepesheva, GIOtt, RDHargrove, TYKleshchenko, YYSchuster, INes, WDHill, GCVillalta, FWaterman, MR Sterol 14alpha-demethylase as a potential target for antitrypanosomal therapy: enzyme inhibition and parasite cell growth. Chem Biol 14:1283-93 (2007)  
Target
Name:
Sterol 14-alpha demethylase
Synonyms:
CP51_TRYCC Cytochrome P450 51 Sterol 14α-demethylase (CYP51) Sterol 14-alpha demethylase (CYP51) | Tc14DM
Type:
Protein
Mol. Mass.:
54690.12
Organism:
Trypanosoma cruzi
Description:
Q7Z1V1
Residue:
481
  
Inhibitor
Name:
BDBM81307
Synonyms:
Azole, 19
Type:
Small organic molecule
Emp. Form.:
C23H19Cl2N4O
Mol. Mass.:
438.329
SMILES:
Clc1ccc(cc1)-c1ccc(cc1)C(=O)NC(C[NH+]1C=CN=C1)c1ccc(Cl)cn1
: