Target
Monoglyceride lipase
Ligand
BDBM81321
Substrate
Meas. Tech.
Inhibition Assay
pH
8±0
IC50
>3.00e+5±n/a nM
Citation
 King, ARDuranti, ATontini, ARivara, SRosengarth, AClapper, JRAstarita, GGeaga, JALuecke, HMor, MTarzia, GPiomelli, D URB602 inhibits monoacylglycerol lipase and selectively blocks 2-arachidonoylglycerol degradation in intact brain slices. Chem Biol 14:1357-65 (2007)  
Target
Name:
Monoglyceride lipase
Synonyms:
MAGL Mgl2 Monoacylglycerol lipase Monoglyceride lipase (MGL)
Type:
Enzyme
Mol. Mass.:
33505.38
Organism:
Rattus norvegicus (Rat)
Description:
Q8R431
Residue:
303
  
Inhibitor
Name:
BDBM81321
Synonyms:
URB602, 3m
Type:
Small organic molecule
Emp. Form.:
C17H19NO4
Mol. Mass.:
301.3371
SMILES:
Cc1cccc(c1)-c1cccc(NC(=O)OC(CO)CO)c1
: