Target
Inosine-5'-monophosphate dehydrogenase 1
Ligand
BDBM50294184
Substrate
Meas. Tech.
Enzyme Inhibition Assay
pH
8±0
Temperature
298.15±0 K
IC50
>5.0e+4±n/a nM
Citation
 Umejiego, NNGollapalli, DSharling, LVolftsun, ALu, JBenjamin, NNStroupe, AHRiera, TVStriepen, BHedstrom, L Targeting a prokaryotic protein in a eukaryotic pathogen: identification of lead compounds against cryptosporidiosis. Chem Biol 15:70-7 (2008)  
Target
Name:
Inosine-5'-monophosphate dehydrogenase 1
Synonyms:
IMDH1_HUMAN IMPD 1 IMPDH-I Inosine Monophosphate Dehydrogenase Type 1 (IMPDH1) | Inosine-5'-monophosphate dehydrogenase (IMPDH)
Type:
Enzyme
Mol. Mass.:
55407.70
Organism:
Homo sapiens (Human)
Description:
Recombinant IMPDH1 expressed in E. coli.
Residue:
514
  
Inhibitor
Name:
BDBM50294184
Synonyms:
CHEMBL561640 N-(4-chlorophenyl)-2-phenoxypropanamide, A | N-(4-chlorophenyl)-2-phenoxypropanamide, Compound A
Type:
Small organic molecule
Emp. Form.:
C15H14ClNO2
Mol. Mass.:
275.73
SMILES:
CC(Oc1ccccc1)C(=O)Nc1ccc(Cl)cc1
: