Target
Tyrosine-protein kinase JAK2
Ligand
BDBM270855
Substrate
Meas. Tech.
JAK Enzyme Assay
IC50
7928±n/a nM
Citation
 Gauvry, NTahtaoui, CFuret, PDucray, P Compounds US Patent  US10059709 Publication Date 8/28/2018 
Target
Name:
Tyrosine-protein kinase JAK2
Synonyms:
JAK-2 JAK2_HUMAN Janus kinase 2 (JAK2) | Janus kinase 2 (a protein tyrosine kinase)
Type:
Protein
Mol. Mass.:
130684.68
Organism:
Homo sapiens (Human)
Description:
O60674
Residue:
1132
  
Inhibitor
Name:
BDBM270855
Synonyms:
US10059709, 1
Type:
Small organic molecule
Emp. Form.:
C15H24N6O2S
Mol. Mass.:
352.455
SMILES:
CNS(=O)(=O)C[C@H]1CC[C@@H](CC1)N(C)c1ncnc2[nH]c(C)nc12
: