Target
Tyrosine-protein kinase JAK1
Ligand
BDBM270863
Substrate
Meas. Tech.
JAK Enzyme Assay
IC50
>10000±n/a nM
Citation
 Gauvry, NTahtaoui, CFuret, PDucray, P Compounds US Patent  US10059709 Publication Date 8/28/2018 
Target
Name:
Tyrosine-protein kinase JAK1
Synonyms:
JAK-1 JAK1A JAK1_HUMAN Janus kinase 1 (JAK1) | Janus kinase 1 JAK1
Type:
Protein
Mol. Mass.:
133293.73
Organism:
Homo sapiens (Human)
Description:
P23458
Residue:
1154
  
Inhibitor
Name:
BDBM270863
Synonyms:
US10059709, 9
Type:
Small organic molecule
Emp. Form.:
C15H22N4O2S2
Mol. Mass.:
354.491
SMILES:
CNS(=O)(=O)C[C@H]1CC[C@@H](CC1)N(C)c1ncnc2sccc12
: