Target
Non-receptor tyrosine-protein kinase TYK2
Ligand
BDBM270868
Substrate
Meas. Tech.
JAK Enzyme Assay
IC50
>10000±n/a nM
Citation
 Gauvry, NTahtaoui, CFuret, PDucray, P Compounds US Patent  US10059709 Publication Date 8/28/2018 
Target
Name:
Non-receptor tyrosine-protein kinase TYK2
Synonyms:
Non-receptor tyrosine-protein kinase TYK2 (TYK2) TYK2_HUMAN | Tyrosine-protein kinase TYK2
Type:
Protein
Mol. Mass.:
133666.03
Organism:
Homo sapiens (Human)
Description:
P29597
Residue:
1187
  
Inhibitor
Name:
BDBM270868
Synonyms:
US10059709, 14
Type:
Small organic molecule
Emp. Form.:
C16H20N4O2S2
Mol. Mass.:
364.486
SMILES:
CNS(=O)(=O)C[C@H]1CC[C@@H](CC1)Nc1c(cnc2sccc12)C#N
: