Target
Olfactory receptor
Ligand
BDBM50028812
Substrate
Meas. Tech.
Inhibition Assay
IC50
5.7e+4± 7e+3 nM
Citation
 Peterlin, ZLi, YSun, GShah, RFirestein, SRyan, K The importance of odorant conformation to the binding and activation of a representative olfactory receptor. Chem Biol 15:1317-27 (2008)  
Target
Name:
Olfactory receptor
Synonyms:
Olfactory receptor 17 | Olr17
Type:
Protein
Mol. Mass.:
35760.42
Organism:
Rattus norvegicus (Rat)
Description:
D3Z9H0
Residue:
319
  
Inhibitor
Name:
BDBM50028812
Synonyms:
Aldehydes, 6 Cycloheptanecarbaldehyde
Type:
Small organic molecule
Emp. Form.:
C8H14O
Mol. Mass.:
126.1962
SMILES:
O=CC1CCCCCC1
: