Target
Probable nicotinate-nucleotide adenylyltransferase
Ligand
BDBM81357
Substrate
Meas. Tech.
Enzymatic Inhibition Assay
IC50
9e+3±n/a nM
Citation
 Sorci, LPan, YEyobo, YRodionova, IHuang, NKurnasov, OZhong, SMacKerell, ADZhang, HOsterman, AL Targeting NAD biosynthesis in bacterial pathogens: Structure-based development of inhibitors of nicotinate mononucleotide adenylyltransferase NadD. Chem Biol 16:849-61 (2009)  
Target
Name:
Probable nicotinate-nucleotide adenylyltransferase
Synonyms:
BAMEG_4595 Deamido-NAD(+) pyrophosphorylase Nicotinate mononucleotide adenylyltransferase Nicotinate-nucleotide adenylyltransferase (NadD) nadD
Type:
Enzyme
Mol. Mass.:
21955.08
Organism:
Bacillus anthracis
Description:
C3L5T6
Residue:
189
  
Inhibitor
Name:
BDBM81357
Synonyms:
NadD inhibitor 3_05 | US8785499, 3_05
Type:
Small organic molecule
Emp. Form.:
C18H11Cl2N3OS2
Mol. Mass.:
420.335
SMILES:
Nc1c(sc2nc(ccc12)-c1cccs1)C(=O)Nc1cc(Cl)ccc1Cl
: