Target
Nicotinate-nucleotide adenylyltransferase
Ligand
BDBM50318653
Substrate
Meas. Tech.
Enzymatic Inhibition Assay
Ki
2.1e+4± 9e+3 nM
Citation
 Sorci, LPan, YEyobo, YRodionova, IHuang, NKurnasov, OZhong, SMacKerell, ADZhang, HOsterman, AL Targeting NAD biosynthesis in bacterial pathogens: Structure-based development of inhibitors of nicotinate mononucleotide adenylyltransferase NadD. Chem Biol 16:849-61 (2009)  
Target
Name:
Nicotinate-nucleotide adenylyltransferase
Synonyms:
Deamido-NAD(+) pyrophosphorylase Nicotinate mononucleotide adenylyltransferase (NadD) nadD | ybeN
Type:
Enzyme
Mol. Mass.:
24523.61
Organism:
Escherichia coli
Description:
P0A752
Residue:
213
  
Inhibitor
Name:
BDBM50318653
Synonyms:
3-amino-N-(3-fluorophenyl)-6-(thiophen-2-yl)thieno[2,3-b]pyridine-2-carboxamide CHEMBL1084955 US8785499, 3_02
Type:
Small organic molecule
Emp. Form.:
C18H12FN3OS2
Mol. Mass.:
369.436
SMILES:
Nc1c(sc2nc(ccc12)-c1cccs1)C(=O)Nc1cccc(F)c1
: