Target
Serine/threonine-protein kinase PAK 6
Ligand
BDBM81375
Substrate
Meas. Tech.
In Vitro Activity Assay
pH
7.5±0
IC50
>10000±0 nM
Citation
 Ranjitkar, PBrock, AMMaly, DJ Affinity reagents that target a specific inactive form of protein kinases. Chem Biol 17:195-206 (2010)  
Target
Name:
Serine/threonine-protein kinase PAK 6
Synonyms:
PAK5 PAK6_HUMAN Serine/threonine-protein kinase PAK6
Type:
PROTEIN
Mol. Mass.:
74897.61
Organism:
Homo sapiens (Human)
Description:
ChEMBL_1513397
Residue:
681
  
Inhibitor
Name:
BDBM81375
Synonyms:
Amine compound, 12a
Type:
Small organic molecule
Emp. Form.:
C41H46F3N9O7
Mol. Mass.:
833.8552
SMILES:
Cc1ccc(NC(=O)c2cccc(c2)C(F)(F)F)cc1Nc1ncccc1-c1ncnc(Nc2ccc(OCCNC(=O)COCCOCCOCCOCCN)cc2)n1
: