Target
Mitogen-activated protein kinase 1
Ligand
BDBM81375
Substrate
Meas. Tech.
In Vitro Activity Assay
pH
7.5±0
IC50
>10000±0 nM
Citation
 Ranjitkar, PBrock, AMMaly, DJ Affinity reagents that target a specific inactive form of protein kinases. Chem Biol 17:195-206 (2010)  
Target
Name:
Mitogen-activated protein kinase 1
Synonyms:
ERK2 Extracellular signal-regulated kinase 2 Extracellular signal-regulated kinase 2 (ERK2) MAPK 2 MK01_HUMAN Mitogen-activated protein kinase 1 (ERK-2) Mitogen-activated protein kinase 2 PRKM2 | p42-MAPK
Type:
Ser/Thr Protein Kinase
Mol. Mass.:
41392.76
Organism:
Homo sapiens (Human)
Description:
P28482
Residue:
360
  
Inhibitor
Name:
BDBM81375
Synonyms:
Amine compound, 12a
Type:
Small organic molecule
Emp. Form.:
C41H46F3N9O7
Mol. Mass.:
833.8552
SMILES:
Cc1ccc(NC(=O)c2cccc(c2)C(F)(F)F)cc1Nc1ncccc1-c1ncnc(Nc2ccc(OCCNC(=O)COCCOCCOCCOCCN)cc2)n1
: