Target
Vascular endothelial growth factor receptor 1
Ligand
BDBM81377
Substrate
Meas. Tech.
In Vitro Activity Kinase Assay
IC50
661±0.0 nM
Kd
32±0.0 nM
Citation
 Zhou, WHur, WMcDermott, UDutt, AXian, WFicarro, SBZhang, JSharma, SVBrugge, JMeyerson, MSettleman, JGray, NS A structure-guided approach to creating covalent FGFR inhibitors. Chem Biol 17:285-95 (2010)  
Target
Name:
Vascular endothelial growth factor receptor 1
Synonyms:
FLT FRT Fms-like tyrosine kinase 1 Tyrosine-protein kinase FRT VEGFR-1 VGFR1_HUMAN Vascular endothelial growth factor receptor 1 (FLT1) Vascular endothelial growth factor receptor 1 and 2 (Flt-1 and KDR) Vascular permeability factor receptor vascular endothelial growth factor/vascular permeability factor receptor
Type:
Receptor Tyrosine Kinase
Mol. Mass.:
150800.23
Organism:
Homo sapiens (Human)
Description:
P17948
Residue:
1338
  
Inhibitor
Name:
BDBM81377
Synonyms:
FIIN-1
Type:
Small organic molecule
Emp. Form.:
C30H35Cl2N7O4
Mol. Mass.:
628.549
SMILES:
CCNCCCCNc1ncc2CN(C(=O)N(Cc3cccc(NC(=O)C=C)c3)c2n1)c1c(Cl)c(OC)cc(OC)c1Cl
: