Target
Inosine-5'-monophosphate dehydrogenase
Ligand
BDBM81428
Substrate
Meas. Tech.
Inhibition Assay
pH
8±0
Temperature
298.15±0 K
IC50
1.1±n/a nM
Citation
 Gollapalli, DRMacpherson, ISLiechti, GGorla, SKGoldberg, JBHedstrom, L Structural determinants of inhibitor selectivity in prokaryotic IMP dehydrogenases. Chem Biol 17:1084-91 (2010)  
Target
Name:
Inosine-5'-monophosphate dehydrogenase
Synonyms:
Inosine-5-monophosphate dehydrogenase (IMPDH)
Type:
Protein
Mol. Mass.:
51794.42
Organism:
Helicobacter pylori (strain G27)
Description:
B5Z7J4
Residue:
481
  
Inhibitor
Name:
BDBM81428
Synonyms:
N-(naphthalen-2-yl)-2-[2-(pyridin-2-yl)-1H-1,3-benzodiazol-1-yl]acetamide, Compound C91
Type:
Small organic molecule
Emp. Form.:
C24H18N4O
Mol. Mass.:
378.4259
SMILES:
O=C(Cn1c(nc2ccccc12)-c1ccccn1)Nc1ccc2ccccc2c1
: