Target
5-hydroxytryptamine receptor 7
Ligand
BDBM50855
Substrate
Ki
9.5±n/a nM
Comments
PDSP_2788
Citation
 Greenberg, DAPrichard, DCSnyder, SH Alpha-noradrenergic receptor binding in mammalian brain: differential labeling of agonist and antagonist states. Life Sci 19:69-76 (1976)  
Target
Name:
5-hydroxytryptamine receptor 7
Synonyms:
5-HT-7 5-HT7 5-HT7S 5-hydroxytryptamine receptor 7 5HT7R_RAT GPRFO Serotonin (5-HT) receptor | Serotonin Receptor 7
Type:
G Protein-Coupled Receptor (GPCR)
Mol. Mass.:
49852.62
Organism:
Rattus norvegicus (rat)
Description:
Rat cloned 5-HT7R.
Residue:
448
  
Inhibitor
Name:
BDBM50855
Synonyms:
ALPHA-ERGOCRYPTINE SMR000058703 | cid_6852403
Type:
Small organic molecule
Emp. Form.:
C32H41N5O5
Mol. Mass.:
575.6984
SMILES:
CC(C)C[C@@H]1N2C(=O)[C@](NC(=O)[C@H]3CN(C)C4Cc5c[nH]c6cccc(C4=C3)c56)(O[C@@]2(O)C2CCCN2C1=O)C(C)C
: