Target
5-hydroxytryptamine receptor 7
Ligand
BDBM30702
Substrate
Ki
6.4±n/a nM
Comments
PDSP_2780
Citation
 Greenberg, DAPrichard, DCSnyder, SH Alpha-noradrenergic receptor binding in mammalian brain: differential labeling of agonist and antagonist states. Life Sci 19:69-76 (1976)  
Target
Name:
5-hydroxytryptamine receptor 7
Synonyms:
5-HT-7 5-HT7 5-HT7S 5-hydroxytryptamine receptor 7 5HT7R_RAT GPRFO Serotonin (5-HT) receptor | Serotonin Receptor 7
Type:
G Protein-Coupled Receptor (GPCR)
Mol. Mass.:
49852.62
Organism:
Rattus norvegicus (rat)
Description:
Rat cloned 5-HT7R.
Residue:
448
  
Inhibitor
Name:
BDBM30702
Synonyms:
ERGOCRISTINE SMR000058447 | cid_31116
Type:
Small organic molecule
Emp. Form.:
C35H39N5O5
Mol. Mass.:
609.7147
SMILES:
[H][C@@]12CCCN1C(=O)[C@H](Cc1ccccc1)N1C(=O)[C@](NC(=O)[C@H]3CN(C)[C@]4([H])Cc5c[nH]c6cccc(C4=C3)c56)(O[C@@]21O)C(C)C
: