Target
Alpha-1A adrenergic receptor
Ligand
BDBM81458
Substrate
Ki
6900±n/a nM
Comments
PDSP_20573
Citation
 U'Prichard, DCGreenberg, DASnyder, SH Binding characteristics of a radiolabeled agonist and antagonist at central nervous system alpha noradrenergic receptors. Mol Pharmacol 13:454-73 (1977) Target
Name:
Alpha-1A adrenergic receptor
Synonyms:
ADA1A_RAT Adra1c Alpha-1A adrenoceptor Alpha-1C adrenergic receptor | adrenergic Alpha1A
Type:
Protein
Mol. Mass.:
51620.15
Organism:
Rattus norvegicus (Rat)
Description:
P43140
Residue:
466
  
Inhibitor
Name:
BDBM81458
Synonyms:
CAS_57-94-3 d-Tubocurarine
Type:
Small organic molecule
Emp. Form.:
C37H41N2O6
Mol. Mass.:
609.7307
SMILES:
COc1cc2CC[N+](C)(C)C3Cc4ccc(O)c(Oc5cc6C(Cc7ccc(Oc(c1O)c23)cc7)N(C)CCc6cc5OC)c4
: