Target
5-hydroxytryptamine receptor 7
Ligand
BDBM50017679
Substrate
Ki
0.9±n/a nM
Comments
PDSP_1477
Citation
 Greengrass, PBremner, R Binding characteristics of 3H-prazosin to rat brain alpha-adrenergic receptors. Eur J Pharmacol 55:323-6 (1979)  
Target
Name:
5-hydroxytryptamine receptor 7
Synonyms:
5-HT-7 5-HT7 5-HT7S 5-hydroxytryptamine receptor 7 5HT7R_RAT GPRFO Serotonin (5-HT) receptor | Serotonin Receptor 7
Type:
G Protein-Coupled Receptor (GPCR)
Mol. Mass.:
49852.62
Organism:
Rattus norvegicus (rat)
Description:
Rat cloned 5-HT7R.
Residue:
448
  
Inhibitor
Name:
BDBM50017679
Synonyms:
Benzyl-(2-chloro-ethyl)-(1-methyl-2-phenoxy-ethyl)-amine Dibenzyline | PHENOXYBENZAMINE
Type:
Small organic molecule
Emp. Form.:
C18H22ClNO
Mol. Mass.:
303.826
SMILES:
CC(COc1ccccc1)N(CCCl)Cc1ccccc1
: