Target
Histamine H1 receptor
Ligand
BDBM50241333
Substrate
Ki
3.2±n/a nM
Comments
PDSP_674
Citation
 Tran, VTChang, RSSnyder, SH Histamine H1 receptors identified in mammalian brain membranes with [3H]mepyramine. Proc Natl Acad Sci U S A 75:6290-4 (1978)  
Target
Name:
Histamine H1 receptor
Synonyms:
HISTAMINE H1 Hrh1
Type:
Enzyme Catalytic Domain
Mol. Mass.:
55716.35
Organism:
RAT
Description:
HISTAMINE H1 HRH1 RAT::P31390
Residue:
486
  
Inhibitor
Name:
BDBM50241333
Synonyms:
4-(benzhydryloxy)-1-methylpiperidine DIPHENYLPYRALINE
Type:
Small organic molecule
Emp. Form.:
C19H23NO
Mol. Mass.:
281.392
SMILES:
CN1CCC(CC1)OC(c1ccccc1)c1ccccc1
: