Target
Histamine H1 receptor
Ligand
BDBM67544
Substrate
Ki
52±n/a nM
Comments
PDSP_1909
Citation
 Tran, VTChang, RSSnyder, SH Histamine H1 receptors identified in mammalian brain membranes with [3H]mepyramine. Proc Natl Acad Sci U S A 75:6290-4 (1978)  
Target
Name:
Histamine H1 receptor
Synonyms:
HISTAMINE H1 Hrh1
Type:
Enzyme Catalytic Domain
Mol. Mass.:
55716.35
Organism:
RAT
Description:
HISTAMINE H1 HRH1 RAT::P31390
Residue:
486
  
Inhibitor
Name:
BDBM67544
Synonyms:
N,N-dimethyl-3-[2-(trifluoromethyl)-10-phenothiazinyl]-1-propanamine;hydrochloride SR-01000000224-4 cid_66069 med.21724, Compound Triflupromazine
Type:
Small organic molecule
Emp. Form.:
C18H19F3N2S
Mol. Mass.:
352.417
SMILES:
CN(C)CCCN1c2ccccc2Sc2ccc(cc12)C(F)(F)F
: