Target
Histamine H1 receptor
Ligand
BDBM81471
Substrate
Ki
35±n/a nM
Comments
PDSP_1915
Citation
 Tran, VTChang, RSSnyder, SH Histamine H1 receptors identified in mammalian brain membranes with [3H]mepyramine. Proc Natl Acad Sci U S A 75:6290-4 (1978)  
Target
Name:
Histamine H1 receptor
Synonyms:
HISTAMINE H1 Hrh1
Type:
Enzyme Catalytic Domain
Mol. Mass.:
55716.35
Organism:
RAT
Description:
HISTAMINE H1 HRH1 RAT::P31390
Residue:
486
  
Inhibitor
Name:
BDBM81471
Synonyms:
CAS_91-81-6 Tripelennamine
Type:
Small organic molecule
Emp. Form.:
C16H21N3
Mol. Mass.:
255.358
SMILES:
CN(C)CCN(Cc1ccccc1)c1ccccn1
: