Target
D(2) dopamine receptor
Ligand
BDBM81486
Substrate
Ki
1.9±n/a nM
Comments
PDSP_1249
Citation
 Burt, DRCreese, ISnyder, SH Properties of [3H]haloperidol and [3H]dopamine binding associated with dopamine receptors in calf brain membranes. Mol Pharmacol 12:800-12 (1976) Target
Name:
D(2) dopamine receptor
Synonyms:
DOPAMINE D2 DRD2_BOVIN | Dopamine D2 receptor
Type:
Enzyme Catalytic Domain
Mol. Mass.:
50698.79
Organism:
BOVINE
Description:
P20288
Residue:
444
  
Inhibitor
Name:
BDBM81486
Synonyms:
CAS_1050-79-9 NSC_4249
Type:
Small organic molecule
Emp. Form.:
C22H26FNO2
Mol. Mass.:
355.4457
SMILES:
Cc1ccc(cc1)C1(O)CCN(CCCC(=O)c2ccc(F)cc2)CC1
: